Home » Uncategorized » llvm revision 210731.

llvm revision 210731.

absvdi2-57ce1f_c absvdi2-57ce1f_sh
make[5]: Entering directory `/opt/llvm/projects/compiler-rt’
COMPILE: clang_linux/builtins-i386/i386: /opt/llvm/projects/compiler-rt/lib/builtins/absvdi2.c
clang: /opt/llvm/include/llvm/CodeGen/SelectionDAGNodes.h:626: llvm::EVT llvm::SDNode::getValueType(unsigned int) const: Assertion `ResNo < NumValues && “Illegal result number!”‘ failed.
0 clang 0x0000000002660a75 llvm::sys::PrintStackTrace(_IO_FILE*) + 37
1 clang 0x0000000002661273
2 libpthread.so.0 0x00007febdb50d4b0
3 libc.so.6 0x00007febda4f1d67 gsignal + 55
4 libc.so.6 0x00007febda4f3118 abort + 328
5 libc.so.6 0x00007febda4eabdd
6 libc.so.6 0x00007febda4eac92
7 clang 0x0000000001e77a7d llvm::SelectionDAG::ReplaceAllUsesOfValueWith(llvm::SDValue, llvm::SDValue) + 717
8 clang 0x0000000001ecadc5 llvm::SelectionDAGISel::MorphNode(llvm::SDNode*, unsigned int, llvm::SDVTList, llvm::ArrayRef<llvm::SDValue>, unsigned int) + 277
9 clang 0x0000000001ecdbdd llvm::SelectionDAGISel::SelectCodeCommon(llvm::SDNode*, unsigned char const*, unsigned int) + 11725
10 clang 0x0000000001d46bb2
11 clang 0x0000000001ec71ba llvm::SelectionDAGISel::DoInstructionSelection() + 746
12 clang 0x0000000001ec61aa llvm::SelectionDAGISel::CodeGenAndEmitDAG() + 3706
13 clang 0x0000000001ec4c88 llvm::SelectionDAGISel::SelectAllBasicBlocks(llvm::Function const&) + 7608
14 clang 0x0000000001ec1f14 llvm::SelectionDAGISel::runOnMachineFunction(llvm::MachineFunction&) + 1348
15 clang 0x0000000001d416a6
16 clang 0x000000000205fc2c llvm::MachineFunctionPass::runOnFunction(llvm::Function&) + 124
17 clang 0x00000000025f258b llvm::FPPassManager::runOnFunction(llvm::Function&) + 539
18 clang 0x00000000025f27fb llvm::FPPassManager::runOnModule(llvm::Module&) + 43
19 clang 0x00000000025f2d77 llvm::legacy::PassManagerImpl::run(llvm::Module&) + 967
20 clang 0x00000000008bde7d clang::EmitBackendOutput(clang::DiagnosticsEngine&, clang::CodeGenOptions const&, clang::TargetOptions const&, clang::LangOptions const&, llvm::StringRef, llvm::Module*, clang::BackendAction, llvm::raw_ostream*) + 7293
21 clang 0x00000000008bb52a
22 clang 0x0000000000a969e3 clang::ParseAST(clang::Sema&, bool, bool) + 467
23 clang 0x00000000006e9fde clang::FrontendAction::Execute() + 62
24 clang 0x00000000006c0e93 clang::CompilerInstance::ExecuteAction(clang::FrontendAction&) + 691
25 clang 0x00000000006a4767 clang::ExecuteCompilerInvocation(clang::CompilerInstance*) + 3079
26 clang 0x000000000069b6d9 cc1_main(char const**, char const**, char const*, void*) + 665
27 clang 0x00000000006a1ce2 main + 8162
28 libc.so.6 0x00007febda4de000 __libc_start_main + 240
29 clang 0x000000000069b36a
Stack dump:
0. Program arguments: /opt/llvm-build/Release+Asserts/bin/clang -cc1 -triple i386-unknown-linux-gnu -emit-obj -disable-free -main-file-name absvdi2.c -mrelocation-model pic -pic-level 2 -fmath-errno -masm-verbose -mconstructor-aliases -target-cpu pentium4 -target-linker-version 2.24 -momit-leaf-frame-pointer -coverage-file /opt/llvm-build/tools/clang/runtime/compiler-rt/clang_linux/builtins-i386/i386/SubDir.lib__builtins/absvdi2.o -resource-dir /opt/llvm-build/Release+Asserts/bin/../lib/clang/3.5.0 -I /opt/llvm/projects/compiler-rt/lib -I /opt/llvm/projects/compiler-rt/include -isysroot /opt/llvm/projects/compiler-rt/SDKs/linux -internal-isystem /opt/llvm/projects/compiler-rt/SDKs/linux/usr/local/include -internal-isystem /opt/llvm-build/Release+Asserts/bin/../lib/clang/3.5.0/include -internal-externc-isystem /opt/llvm/projects/compiler-rt/SDKs/linux/include -internal-externc-isystem /opt/llvm/projects/compiler-rt/SDKs/linux/usr/include -O3 -Wall -Werror -fdebug-compilation-dir /opt/llvm/projects/compiler-rt -ferror-limit 19 -fmessage-length 136 -mstackrealign -fobjc-runtime=gcc -fdiagnostics-show-option -fcolor-diagnostics -vectorize-loops -vectorize-slp -o /opt/llvm-build/tools/clang/runtime/compiler-rt/clang_linux/builtins-i386/i386/SubDir.lib__builtins/absvdi2.o -x c /opt/llvm/projects/compiler-rt/lib/builtins/absvdi2.c
1. <eof> parser at end of file
2. Code generation
3. Running pass ‘Function Pass Manager’ on module ‘/opt/llvm/projects/compiler-rt/lib/builtins/absvdi2.c’.
4. Running pass ‘X86 DAG->DAG Instruction Selection’ on function ‘@__absvdi2’
clang: error: unable to execute command: Aborted (core dumped)
clang: error: clang frontend command failed due to signal (use -v to see invocation)
clang version 3.5.0 (trunk 210233)
Target: i386-unknown-linux-gnu
Thread model: posix
clang: note: diagnostic msg: PLEASE submit a bug report to http://llvm.org/bugs/ and include the crash backtrace, preprocessed source, and associated run script.
clang: note: diagnostic msg:
********************
PLEASE ATTACH THE FOLLOWING FILES TO THE BUG REPORT:
Preprocessed source(s) and associated run script(s) are located at:
clang: note: diagnostic msg: /tmp/absvdi2-38b40d.c
clang: note: diagnostic msg: /tmp/absvdi2-38b40d.sh
clang: note: diagnostic msg:
********************
make[5]: *** [/opt/llvm-build/tools/clang/runtime/compiler-rt/clang_linux/builtins-i386/i386/SubDir.lib__builtins/absvdi2.o] Error 254
make[5]: Leaving directory `/opt/llvm/projects/compiler-rt’
make[4]: *** [BuildRuntimeLibraries] Error 2
make[4]: Leaving directory `/opt/llvm-build/tools/clang/runtime/compiler-rt’
make[3]: *** [compiler-rt/.makeall] Error 2
make[3]: Leaving directory `/opt/llvm-build/tools/clang/runtime’
make[2]: *** [all] Error 1
make[2]: Leaving directory `/opt/llvm-build/tools/clang’
make[1]: *** [clang/.makeall] Error 2
make[1]: Leaving directory `/opt/llvm-build/tools’
make: *** [all] Error 1
llvm-build$
Advertisements

Leave a Reply

Fill in your details below or click an icon to log in:

WordPress.com Logo

You are commenting using your WordPress.com account. Log Out / Change )

Twitter picture

You are commenting using your Twitter account. Log Out / Change )

Facebook photo

You are commenting using your Facebook account. Log Out / Change )

Google+ photo

You are commenting using your Google+ account. Log Out / Change )

Connecting to %s